Reaction Details
TargetD(2) dopamine receptor
LigandBDBM82479
Substrate/Competitorn/a
Ki 31.8±n/a nM
CommentsPDSP_1408
Citation Kongsamut, SKang, JChen, XLRoehr, JRampe, D A comparison of the receptor binding and HERG channel affinities for a series of antipsychotic drugs. Eur J Pharmacol450:37-41 (2002) 
 
D(2) dopamine receptor
Name:D(2) dopamine receptor
Type:Cell-surface receptors
Mol. Mass.:50647.10
Organism:Homo sapiens (Human)
Description:P14416
Residue:443
BDBM82479
NameBDBM82479
Synonyms:CAS_132539-06-1 OLANZAPINE | USRE49340, Rank 2
TypeSmall organic molecule
Emp. Form.C17H20N4S
Mol. Mass.312.432
SMILESCN1CCN(CC1)C1=c2cc(C)sc2=Nc2ccccc2N1