Reaction Details
Targetneuronal acetylcholine receptor subunit alpha-2
LigandBDBM86045
Substrate/Competitorn/a
Ki 0.062±n/a nM
CommentsPDSP_2904
Citation Avalos, MParker, MJMaddox, FNCarroll, FILuetje, CW Effects of pyridine ring substitutions on affinity, efficacy, and subtype selectivity of neuronal nicotinic receptor agonist epibatidine. J Pharmacol Exp Ther302:1246-52 (2002) 
 
neuronal acetylcholine receptor subunit alpha-2
Name:neuronal acetylcholine receptor subunit alpha-2
Type:Enzyme Catalytic Domain
Mol. Mass.:59160.03
Organism:Xenopus
Description:A0A6I8T284
Residue:510
BDBM86045
NameBDBM86045
Synonyms:NNEP
TypeSmall organic molecule
Emp. Form.C11H15N3
Mol. Mass.189.2569
SMILESNc1ccc(cn1)[C@H]1CC2CCC1N2