Reaction Details
Targetcholinergic receptor, nicotinic, alpha 1 (Muscle) isoform X1
LigandBDBM86042
Substrate/Competitorn/a
Ki 0.0031±n/a nM
CommentsPDSP_2905
Citation Avalos, MParker, MJMaddox, FNCarroll, FILuetje, CW Effects of pyridine ring substitutions on affinity, efficacy, and subtype selectivity of neuronal nicotinic receptor agonist epibatidine. J Pharmacol Exp Ther302:1246-52 (2002) 
 
cholinergic receptor, nicotinic, alpha 1 (Muscle) isoform X1
Name:cholinergic receptor, nicotinic, alpha 1 (Muscle) isoform X1
Synonyms:Cholinergic, Nicotinic Alpha3Beta2
Type:Enzyme Catalytic Domain
Mol. Mass.:51980.65
Organism:Xenopus
Description:Cholinergic, Nicotinic Alpha3Beta2 0 Xenopus::F6RLM5
Residue:457
BDBM86042
NameBDBM86042
Synonyms:NEP
TypeSmall organic molecule
Emp. Form.C11H14N2
Mol. Mass.174.2423
SMILESC1CC2NC1C[C@@H]2c1cccnc1