Reaction Details
Targetcholinergic receptor, nicotinic, alpha 1 (Muscle) isoform X1
LigandBDBM86041
Substrate/Competitorn/a
Ki 0.0038±n/a nM
CommentsPDSP_2906
Citation Avalos, MParker, MJMaddox, FNCarroll, FILuetje, CW Effects of pyridine ring substitutions on affinity, efficacy, and subtype selectivity of neuronal nicotinic receptor agonist epibatidine. J Pharmacol Exp Ther302:1246-52 (2002) 
 
cholinergic receptor, nicotinic, alpha 1 (Muscle) isoform X1
Name:cholinergic receptor, nicotinic, alpha 1 (Muscle) isoform X1
Synonyms:Cholinergic, Nicotinic Alpha3Beta2
Type:Enzyme Catalytic Domain
Mol. Mass.:51980.65
Organism:Xenopus
Description:Cholinergic, Nicotinic Alpha3Beta2 0 Xenopus::F6RLM5
Residue:457
BDBM86041
NameBDBM86041
Synonyms:NFEP
TypeSmall organic molecule
Emp. Form.C11H13FN2
Mol. Mass.192.2327
SMILESFc1ccc(cn1)[C@H]1CC2CCC1N2