Reaction Details
Targetneuronal acetylcholine receptor subunit alpha-4
LigandBDBM86043
Substrate/Competitorn/a
Ki 100±n/a nM
CommentsPDSP_2902
Citation Avalos, MParker, MJMaddox, FNCarroll, FILuetje, CW Effects of pyridine ring substitutions on affinity, efficacy, and subtype selectivity of neuronal nicotinic receptor agonist epibatidine. J Pharmacol Exp Ther302:1246-52 (2002) 
 
neuronal acetylcholine receptor subunit alpha-4
Name:neuronal acetylcholine receptor subunit alpha-4
Synonyms:Cholinergic, Nicotinic Alpha4Beta2
Type:Enzyme Catalytic Domain
Mol. Mass.:81710.63
Organism:Xenopus
Description:Cholinergic, Nicotinic Alpha4Beta2 0 Xenopus::A9JRM3
Residue:734
BDBM86043
NameBDBM86043
Synonyms:NDMNEP
TypeSmall organic molecule
Emp. Form.C13H19N3
Mol. Mass.217.3101
SMILESCN(C)c1ccc(cn1)[C@H]1CC2CCC1N2