Reaction Details
Targetneuronal acetylcholine receptor subunit alpha-4
LigandBDBM86045
Substrate/Competitorn/a
Ki 0.35±n/a nM
CommentsPDSP_2904
Citation Avalos, MParker, MJMaddox, FNCarroll, FILuetje, CW Effects of pyridine ring substitutions on affinity, efficacy, and subtype selectivity of neuronal nicotinic receptor agonist epibatidine. J Pharmacol Exp Ther302:1246-52 (2002) 
 
neuronal acetylcholine receptor subunit alpha-4
Name:neuronal acetylcholine receptor subunit alpha-4
Synonyms:Cholinergic, Nicotinic Alpha4Beta2
Type:Enzyme Catalytic Domain
Mol. Mass.:81710.63
Organism:Xenopus
Description:Cholinergic, Nicotinic Alpha4Beta2 0 Xenopus::A9JRM3
Residue:734
BDBM86045
NameBDBM86045
Synonyms:NNEP
TypeSmall organic molecule
Emp. Form.C11H15N3
Mol. Mass.189.2569
SMILESNc1ccc(cn1)[C@H]1CC2CCC1N2