Reaction Details
TargetSubstance-P receptor
LigandBDBM50071112
Substrate/Competitorn/a
Ki 273±n/a nM
CommentsPDSP_1755
Citation Anthes, JCChapman, RWRichard, CEckel, SCorboz, MHey, JAFernandez, XGreenfeder, SMcLeod, RSehring, SRizzo, CCrawley, YShih, NYPiwinski, JReichard, GTing, PCarruthers, NCuss, FMBillah, MKreutner, WEgan, RW SCH 206272: a potent, orally active tachykinin NK(1), NK(2), and NK(3) receptor antagonist. Eur J Pharmacol450:191-202 (2002) 
 
Substance-P receptor
Name:Substance-P receptor
Type:G Protein-Coupled Receptor (GPCR)
Mol. Mass.:46254.43
Organism:Homo sapiens (Human)
Description:P25103
Residue:407
BDBM50071112
NameBDBM50071112
Synonyms:CHEMBL56835 SR 48968
TypeSmall organic molecule
Emp. Form.C31H35Cl2N3O2
Mol. Mass.552.535
SMILESCN(CC(CCN1CCC(CC1)(NC(C)=O)c1ccccc1)c1ccc(Cl)c(Cl)c1)C(=O)c1ccccc1