Reaction Details
TargetNeuromedin-K receptor
LigandBDBM50116078
Substrate/Competitorn/a
Ki 0.3±n/a nM
CommentsPDSP_3952
Citation Anthes, JCChapman, RWRichard, CEckel, SCorboz, MHey, JAFernandez, XGreenfeder, SMcLeod, RSehring, SRizzo, CCrawley, YShih, NYPiwinski, JReichard, GTing, PCarruthers, NCuss, FMBillah, MKreutner, WEgan, RW SCH 206272: a potent, orally active tachykinin NK(1), NK(2), and NK(3) receptor antagonist. Eur J Pharmacol450:191-202 (2002) 
 
Neuromedin-K receptor
Name:Neuromedin-K receptor
Type:Enzyme
Mol. Mass.:52221.96
Organism:Homo sapiens (Human)
Description:P29371
Residue:465
BDBM50116078
NameBDBM50116078
Synonyms:3,5-Dichloro-N-[3-(3,4-dichloro-phenyl)-2-methoxyimino-5-(3-methylcarbamoylmethyl-2-oxo-[1,4']bipiperidinyl-1'-yl)-pentyl]-N-ethyl-benzamide SCH 206272
TypeSmall organic molecule
Emp. Form.C33H41Cl4N5O4
Mol. Mass.713.522
SMILESCNC(=O)CC1CCCN(C2CCN(CC[C@@H](\C(CN(C)C(=O)c3cc(Cl)cc(Cl)c3)=N\OC)c3ccc(Cl)c(Cl)c3)CC2)C1=O