Reaction Details
TargetMuscarinic acetylcholine receptor M1
LigandBDBM25870
Substrate/Competitorn/a
Ki 1242±n/a nM
CommentsPDSP_3045
Citation Owens, JMKnight, DLNemeroff, CB [Second generation SSRIS: human monoamine transporter binding profile of escitalopram and R-fluoxetine]. Encephale28:350-5 (2002) Muscarinic acetylcholine receptor M1
Name:Muscarinic acetylcholine receptor M1
Type:Protein
Mol. Mass.:51442.54
Organism:Homo sapiens (Human)
Description:P11229
Residue:460
BDBM25870
NameBDBM25870
Synonyms:1-[3-(dimethylamino)propyl]-1-(4-fluorophenyl)-1,3-dihydro-2-benzofuran-5-carbonitrile CITALOPRAM Escitalopram [3H]Cytalopram [3H]Lexapro
Typeradiolabeled ligand
Emp. Form.C20H21FN2O
Mol. Mass.324.3919
SMILESCN(C)CCCC1(OCc2cc(ccc12)C#N)c1ccc(F)cc1