Reaction Details
TargetSodium-dependent noradrenaline transporter
LigandBDBM50028091
Substrate/Competitorn/a
Ki 1119±n/a nM
CommentsPDSP_844
Citation Owens, JMKnight, DLNemeroff, CB [Second generation SSRIS: human monoamine transporter binding profile of escitalopram and R-fluoxetine]. Encephale28:350-5 (2002) Sodium-dependent noradrenaline transporter
Name:Sodium-dependent noradrenaline transporter
Type:Multi-pass membrane protein
Mol. Mass.:69337.72
Organism:Homo sapiens (Human)
Description:P23975
Residue:617
BDBM50028091
NameBDBM50028091
Synonyms:(1E)-5-methoxy-1-[4-(trifluoromethyl)phenyl]pentan-1-one O-(2-aminoethyl)oxime FLUVOXAMINE
TypeSmall organic molecule
Emp. Form.C15H21F3N2O2
Mol. Mass.318.3346
SMILESCOCCCC\C(=N/OCCN)c1ccc(cc1)C(F)(F)F