Reaction Details
TargetVasoactive intestinal polypeptide receptor 1
LigandBDBM86051
Substrate/Competitorn/a
Ki 7.7±n/a nM
CommentsPDSP_3072
Citation Igarashi, HIto, TPradhan, TKMantey, SAHou, WCoy, DHJensen, RT Elucidation of the vasoactive intestinal peptide pharmacophore for VPAC(2) receptors in human and rat and comparison to the pharmacophore for VPAC(1) receptors. J Pharmacol Exp Ther303:445-60 (2002) 
 
Vasoactive intestinal polypeptide receptor 1
Name:Vasoactive intestinal polypeptide receptor 1
Type:Enzyme Catalytic Domain
Mol. Mass.:51557.18
Organism:Homo sapiens (Human)
Description:VIP 1 VIPR1 0::P32241
Residue:457
BDBM86051
NameBDBM86051
Synonyms:CAS_0 [Lys15, Arg16, Leu27]VIP(1-7)GRF(8-27)
TypeSmall organic molecule
Emp. Form.C144H244N44O38
Mol. Mass.3199.7502
SMILESCC[C@H](C)[C@H](NC(=O)[C@H](CC(O)=O)NC(=O)[C@H](CCC(N)=O)NC(=O)[C@H](CC(C)C)NC(=O)[C@H](CC(C)C)NC(=O)[C@H](CCCCN)NC(=O)[C@H](CCCN=C(N)N)NC(=O)[C@H](C)NC(=O)[C@H](CO)NC(=O)[C@H](CC(C)C)NC(=O)[C@H](CCCCN=C(N)N)NC(=O)[C@H](CCCCN)NC(=O)[C@H](CC(C)C)NC(=O)[C@@H](NC(=O)[C@H](CCCCN)NC(=O)[C@H](CCCN=C(N)N)NC(=O)[C@H](Cc1ccc(O)cc1)NC(=O)[C@H](CO)NC(=O)[C@H](CCC(N)=O)NC(=O)[C@@H](NC(=O)[C@H](Cc1ccccc1)NC(=O)[C@@H](NC(=O)[C@H](C)NC(=O)[C@H](CC(O)=O)NC(=O)[C@H](CO)NC(=O)[C@@H](N)Cc1cnc[nH]1)C(C)C)[C@@H](C)O)C(C)C)C(=O)N[C@@H](CC(C)C)C(N)=O