Reaction Details
TargetSubstance-K receptor
LigandBDBM86055
Substrate/Competitorn/a
Ki 71±n/a nM
CommentsPDSP_2982
Citation Emonds-Alt, XProietto, VSteinberg, ROury-Donat, FVigé, XVilain, PNaline, EDaoui, SAdvenier, CLe Fur, GMaffrand, JPSoubrié, PPascal, M SSR240600 [(R)-2-(1-[2-[4-[2-[3,5-bis(trifluoromethyl)phenyl]acetyl]-2-(3,4-dichlorophenyl)-2-morpholinyl]ethyl]- 4-piperidinyl)-2-methylpropanamide], a centrally active nonpeptide antagonist of the tachykinin neurokinin-1 receptor: I. biochemical and pharmacological characterization. J Pharmacol Exp Ther303:1171-9 (2002) 
 
Substance-K receptor
Name:Substance-K receptor
Type:Enzyme Catalytic Domain
Mol. Mass.:45106.00
Organism:GUINEA PIG
Description:Neurokinin NK2 TACR2 GUINEA PIG::Q64077
Residue:402
BDBM86055
NameBDBM86055
Synonyms:SSR240600
TypeSmall organic molecule
Emp. Form.C31H35Cl2F6N3O3
Mol. Mass.682.524
SMILESCC(C)(C1CCN(CCC2(CN(CCO2)C(=O)Cc2cc(cc(c2)C(F)(F)F)C(F)(F)F)c2ccc(Cl)c(Cl)c2)CC1)C(N)=O