Reaction Details
TargetNeuromedin-K receptor
LigandBDBM85083
Substrate/Competitorn/a
Ki 0.34±n/a nM
CommentsPDSP_1335
Citation Emonds-Alt, XProietto, VSteinberg, ROury-Donat, FVigé, XVilain, PNaline, EDaoui, SAdvenier, CLe Fur, GMaffrand, JPSoubrié, PPascal, M SSR240600 [(R)-2-(1-[2-[4-[2-[3,5-bis(trifluoromethyl)phenyl]acetyl]-2-(3,4-dichlorophenyl)-2-morpholinyl]ethyl]- 4-piperidinyl)-2-methylpropanamide], a centrally active nonpeptide antagonist of the tachykinin neurokinin-1 receptor: I. biochemical and pharmacological characterization. J Pharmacol Exp Ther303:1171-9 (2002) 
 
Neuromedin-K receptor
Name:Neuromedin-K receptor
Type:Enzyme
Mol. Mass.:52221.96
Organism:Homo sapiens (Human)
Description:P29371
Residue:465
BDBM85083
NameBDBM85083
Synonyms:NKB [MePhe7]
TypeSmall organic molecule
Emp. Form.C56H81N13O14S2
Mol. Mass.1224.451
SMILESCSCC[C@H](NC(=O)[C@H](CC(C)C)NC(=O)CNC(=O)[C@@H](NC(=O)[C@H](Cc1ccccc1)NC(=O)[C@H](Cc1ccccc1)N(C)C(=O)[C@H](CC(O)=O)NC(=O)[C@H](Cc1cnc[nH]1)NC(=O)[C@H](CCSC)NC(=O)[C@@H](N)CC(O)=O)C(C)C)C(N)=O