Reaction Details
Target5-hydroxytryptamine receptor 2A
LigandBDBM86057
Substrate/Competitorn/a
Ki 1.5±n/a nM
CommentsPDSP_3030
Citation Hameg, ABayle, FNuss, PDupuis, PGaray, RPDib, M Affinity of cyamemazine, an anxiolytic antipsychotic drug, for human recombinant dopamine vs. serotonin receptor subtypes. Biochem Pharmacol65:435-40 (2003) 
 
5-hydroxytryptamine receptor 2A
Name:5-hydroxytryptamine receptor 2A
Type:undefined
Mol. Mass.:52607.65
Organism:Homo sapiens (Human)
Description:P28223
Residue:471
BDBM86057
NameBDBM86057
Synonyms:CAS_62865 NSC_62865
TypeSmall organic molecule
Emp. Form.C19H21N3S
Mol. Mass.323.455
SMILESCC(CN(C)C)CN1c2ccccc2Sc2ccc(cc12)C#N