Reaction Details
TargetAlpha-1A adrenergic receptor
LigandBDBM86057
Substrate/Competitorn/a
Ki 2.3±n/a nM
CommentsPDSP_3030
Citation Hameg, ABayle, FNuss, PDupuis, PGaray, RPDib, M Affinity of cyamemazine, an anxiolytic antipsychotic drug, for human recombinant dopamine vs. serotonin receptor subtypes. Biochem Pharmacol65:435-40 (2003) 
 
Alpha-1A adrenergic receptor
Name:Alpha-1A adrenergic receptor
Type:Protein
Mol. Mass.:51620.15
Organism:Rattus norvegicus (Rat)
Description:P43140
Residue:466
BDBM86057
NameBDBM86057
Synonyms:CAS_62865 NSC_62865
TypeSmall organic molecule
Emp. Form.C19H21N3S
Mol. Mass.323.455
SMILESCC(CN(C)C)CN1c2ccccc2Sc2ccc(cc12)C#N