Reaction Details
TargetTyrosine-protein kinase CSK
LigandBDBM50142887
Substrate/Competitorn/a
Ki 730±n/a nM
CommentsPDSP_6410
Citation Bain, JMcLauchlan, HElliott, MCohen, P The specificities of protein kinase inhibitors: an update. Biochem J371:199-204 (2003) 
 
Tyrosine-protein kinase CSK
Name:Tyrosine-protein kinase CSK
Type:Tyrosine-protein kinase
Mol. Mass.:50707.30
Organism:Homo sapiens (Human)
Description:P41240
Residue:450
BDBM50142887
NameBDBM50142887
Synonyms:1-(tert-butyl)-3-(4-chlorophenyl)-4-aminopyrazolo[3,4-d]pyrimidine 1-tert-butyl-3-(4-chlorophenyl)-1H-pyrazolo[3,4-d]pyrimidin-4-amine 4-amino-5-(4-chlorophenyl)-7-(tert-butyl)pyrazolo[3,4-d]pyrimidine CHEMBL406845 US10544104, Compound 146 US11701353, PP2 (Pfizer) cid_4878
TypeSmall organic molecule
Emp. Form.C15H16ClN5
Mol. Mass.301.774
SMILESCC(C)(C)n1nc(-c2ccc(Cl)cc2)c2c(N)ncnc12