Reaction Details
TargetTyrosine-protein kinase Lck
LigandBDBM7262
Substrate/Competitorn/a
Ki 470±n/a nM
CommentsPDSP_6408
Citation Bain, JMcLauchlan, HElliott, MCohen, P The specificities of protein kinase inhibitors: an update. Biochem J371:199-204 (2003) 
 
Tyrosine-protein kinase Lck
Name:Tyrosine-protein kinase Lck
Type:n/a
Mol. Mass.:57987.83
Organism:Homo sapiens (Human)
Description:P06239
Residue:509
BDBM7262
NameBDBM7262
Synonyms:14-nitro-8,18-diazatetracyclo[9.7.0.0^{2,7}.0^{12,17}]octadeca-1(11),2,4,6,12(17),13,15-heptaen-9-one BDBM84528 NSC 705701 alsterpaullone
TypeSmall organic molecule
Emp. Form.C16H11N3O3
Mol. Mass.293.2768
SMILES[O-][N+](=O)c1ccc2[nH]c-3c(CC(=O)Nc4ccccc-34)c2c1