Reaction Details
TargetType-1 angiotensin II receptor B
LigandBDBM50240609
Substrate/Competitorn/a
Ki 0.12±n/a nM
CommentsPDSP_3386
Citation Inada, YNakane, TChiba, S Binding of KRH-594, an antagonist of the angiotensin II type 1 receptor, to cloned human and rat angiotensin II receptors. Fundam Clin Pharmacol16:317-23 (2002) 
 
Type-1 angiotensin II receptor B
Name:Type-1 angiotensin II receptor B
Type:Enzyme Catalytic Domain
Mol. Mass.:40929.44
Organism:RAT
Description:Angiotensin II AT1B 0 RAT::P29089
Residue:359
BDBM50240609
NameBDBM50240609
Synonyms:2-Ethoxy-3-[2'-(1H-tetrazol-5-yl)-biphenyl-4-ylmethyl]-3H-benzoimidazole-4-carboxylic acid(CV-11974) 2-ethoxy-3-[2'-(1H-tetrazol-5-yl)-biphenyl-4-ylmethyl]-3H-benzoimidazole-4-carboxylic acid CHEMBL1016 | CV-11974
TypeSmall organic molecule
Emp. Form.C24H20N6O3
Mol. Mass.440.454
SMILESCCOc1nc2cccc(C(O)=O)c2n1Cc1ccc(cc1)-c1ccccc1-c1nnn[nH]1