Reaction Details
TargetHrh3 protein
LigandBDBM86061
Substrate/Competitorn/a
Ki 2.51±n/a nM
CommentsPDSP_2990
Citation Esbenshade, TAKrueger, KMMiller, TRKang, CHDenny, LIWitte, DGYao, BBFox, GBFaghih, RBennani, YLWilliams, MHancock, AA Two novel and selective nonimidazole histamine H3 receptor antagonists A-304121 and A-317920: I. In vitro pharmacological effects. J Pharmacol Exp Ther305:887-96 (2003) 
 
Hrh3 protein
Name:Hrh3 protein
Type:Enzyme Catalytic Domain
Mol. Mass.:37860.96
Organism:RAT
Description:Q5PPG3
Residue:344
BDBM86061
NameBDBM86061
Synonyms:A-304121
TypeSmall organic molecule
Emp. Form.C7H7N3O3
Mol. Mass.181.1488
SMILESCCn1c2nocc2c(=O)[nH]c1=O