Reaction Details
TargetHistamine H3 receptor
LigandBDBM50158601
Substrate/Competitorn/a
Ki 2.40±n/a nM
CommentsPDSP_2991
Citation Esbenshade, TAKrueger, KMMiller, TRKang, CHDenny, LIWitte, DGYao, BBFox, GBFaghih, RBennani, YLWilliams, MHancock, AA Two novel and selective nonimidazole histamine H3 receptor antagonists A-304121 and A-317920: I. In vitro pharmacological effects. J Pharmacol Exp Ther305:887-96 (2003) 
 
Histamine H3 receptor
Name:Histamine H3 receptor
Type:Enzyme Catalytic Domain
Mol. Mass.:48753.61
Organism:GUINEA PIG
Description:HISTAMINE H3 HRH3 GUINEA PIG::Q9JI35
Residue:445
BDBM50158601
NameBDBM50158601
Synonyms:A-317920 Furan-2-carboxylic acid ((R)-2-{4-[3-(4-cyclopropanecarbonyl-phenoxy)-propyl]-piperazin-1-yl}-1-methyl-2-oxo-ethyl)-amide
TypeSmall organic molecule
Emp. Form.C25H31N3O5
Mol. Mass.453.5307
SMILESC[C@@H](NC(=O)c1ccco1)C(=O)N1CCN(CCCOc2ccc(cc2)C(=O)C2CC2)CC1