Reaction Details
TargetHistamine H3 receptor
LigandBDBM22541
Substrate/Competitorn/a
Ki 0.36±n/a nM
CommentsPDSP_539
Citation Esbenshade, TAKrueger, KMMiller, TRKang, CHDenny, LIWitte, DGYao, BBFox, GBFaghih, RBennani, YLWilliams, MHancock, AA Two novel and selective nonimidazole histamine H3 receptor antagonists A-304121 and A-317920: I. In vitro pharmacological effects. J Pharmacol Exp Ther305:887-96 (2003) 
 
Histamine H3 receptor
Name:Histamine H3 receptor
Type:G Protein-Coupled Receptor (GPCR)
Mol. Mass.:48691.47
Organism:Homo sapiens (Human)
Description:Binding assays were using CHO cells stably expressing hH3R receptors.
Residue:445
BDBM22541
NameBDBM22541
Synonyms:Clobenpropit VUF 9153 VUF9153
TypeSmall organic molecule
Emp. Form.C14H17ClN4S
Mol. Mass.308.83
SMILESNC(SCCCc1cnc[nH]1)=NCc1ccc(Cl)cc1