Reaction Details
TargetCathepsin B
LigandBDBM86094
Substrate/CompetitorBDBM16498
Meas. Tech.Cathepsin Inhibition Assay
pH6±0
Temperature296.15±0 K
Ki 9.2e+4±n/a nM
Citation Yadav, MRShinde, AKChouhan, BSGiridhar, RMenard, R Peptidomimetic 2-cyanopyrrolidines as potent selective cathepsin L inhibitors. J Enzyme Inhib Med Chem23:190-7 (2008) 
 
Cathepsin B
Name:Cathepsin B
Type:Enzyme
Mol. Mass.:37819.69
Organism:Homo sapiens (Human)
Description:gi_63102437
Residue:339
BDBM86094
BDBM16498
NameBDBM86094
Synonyms:2-Cyanopyrrolidine Derivative, 23
TypeSmall organic molecule
Emp. Form.C21H27N3O3
Mol. Mass.369.4574
SMILESCOc1ccc(\C=C\C(=O)NC(CC(C)C)C(=O)N2CCC[C@H]2C#N)cc1