Reaction Details
TargetL-lactate dehydrogenase A chain
LigandBDBM86113
Substrate/Competitorn/a
Meas. Tech.Enzyme Assay
pH7.5±0
Temperature294.15±0 K
IC50>5.00e+5±n/a nM
Citation Ward, RABrassington, CBreeze, ALCaputo, ACritchlow, SDavies, GGoodwin, LHassall, GGreenwood, RHoldgate, GAMrosek, MNorman, RAPearson, STart, JTucker, JAVogtherr, MWhittaker, DWingfield, JWinter, JHudson, K Design and synthesis of novel lactate dehydrogenase a inhibitors by fragment-based lead generation. J Med Chem55:3285-306 (2012) 
 
L-lactate dehydrogenase A chain
Name:L-lactate dehydrogenase A chain
Type:Protein
Mol. Mass.:36694.85
Organism:Homo sapiens (Human)
Description:P00338::PDB Code: 4ajp
Residue:332
BDBM86113
NameBDBM86113
Synonyms:LDHA Inhibitor, 7
TypeSmall organic molecule
Emp. Form.C11H15N2O8P
Mol. Mass.334.2203
SMILESNC(=O)C1=CN(C=CC1)[C@H]1O[C@@H](COP([O-])([O-])=O)[C@H](O)[C@@H]1O