Reaction Details
TargetL-lactate dehydrogenase A chain
LigandBDBM86125
Substrate/Competitorn/a
Meas. Tech.Nuclear Magnetic Resonance (NMR) Assay
pH7.5±0
Kd 1.000e+6±n/a nM
Citation Ward, RABrassington, CBreeze, ALCaputo, ACritchlow, SDavies, GGoodwin, LHassall, GGreenwood, RHoldgate, GAMrosek, MNorman, RAPearson, STart, JTucker, JAVogtherr, MWhittaker, DWingfield, JWinter, JHudson, K Design and synthesis of novel lactate dehydrogenase a inhibitors by fragment-based lead generation. J Med Chem55:3285-306 (2012) 
 
L-lactate dehydrogenase A chain
Name:L-lactate dehydrogenase A chain
Type:Protein
Mol. Mass.:36456.12
Organism:Rattus norvegicus (Rat)
Description:P04642::PDB Codes: 4ajl, 4aj2, 4aje, 4aji, 4ajk, 4ajh, 4ajl, 4al4, 4ajh, 4ajo
Residue:332
BDBM86125
NameBDBM86125
Synonyms:LDHA Inhibitor, 21
TypeSmall organic molecule
Emp. Form.C12H14O6
Mol. Mass.254.236
SMILESCOc1ccc(CC(C(O)=O)C(O)=O)cc1OC