Reaction Details
TargetL-lactate dehydrogenase A chain
LigandBDBM86127
Substrate/Competitorn/a
Meas. Tech.Surface Plasmon Resonance (SPR) Assay
pH7.4±0
Kd 3.5e+4±n/a nM
Citation Ward, RABrassington, CBreeze, ALCaputo, ACritchlow, SDavies, GGoodwin, LHassall, GGreenwood, RHoldgate, GAMrosek, MNorman, RAPearson, STart, JTucker, JAVogtherr, MWhittaker, DWingfield, JWinter, JHudson, K Design and synthesis of novel lactate dehydrogenase a inhibitors by fragment-based lead generation. J Med Chem55:3285-306 (2012) 
 
L-lactate dehydrogenase A chain
Name:L-lactate dehydrogenase A chain
Type:Protein
Mol. Mass.:36456.12
Organism:Rattus norvegicus (Rat)
Description:P04642::PDB Codes: 4ajl, 4aj2, 4aje, 4aji, 4ajk, 4ajh, 4ajl, 4al4, 4ajh, 4ajo
Residue:332
BDBM86127
NameBDBM86127
Synonyms:LDHA Inhibitor, 23
TypeSmall organic molecule
Emp. Form.C14H18N4O2S2
Mol. Mass.338.448
SMILESCCCSc1nc2ccc(NC(=O)CCNC(N)=O)cc2s1