Reaction Details
TargetTransthyretin
LigandBDBM249477
Substrate/Competitorn/a
Meas. Tech.Scintillation Proximity RBP4 Binding Assay
pH7.4±n/a
Temperature298.15±n/a K
IC50 19.7±n/a nM
Commentsextracted
Citation Petrukhin, KCioffi, CJohnson, GAllikmets, RFreeman, EChen, PConlon, MZhu, L Substituted 4-phenylpiperidines, their preparation and use US Patent US10072016 Publication Date 9/11/2018
 
Transthyretin
Name:Transthyretin
Type:Enzyme
Mol. Mass.:15884.31
Organism:Homo sapiens (Human)
Description:P02766
Residue:147
BDBM249477
NameBDBM249477
Synonyms:US10072016, Compound 76 US10913746, Compound 76 US9434727, 76 | US9777010, Compound 76
TypeSmall organic molecule
Emp. Form.C22H23F7N4O
Mol. Mass.492.433
SMILESFc1cccc(C2CCN(CC2)C(=O)c2n[nH]c3CN(CCC(F)(F)F)CCc23)c1C(F)(F)F