Reaction Details
TargetTransthyretin
LigandBDBM249526
Substrate/Competitorn/a
Meas. Tech.Scintillation Proximity RBP4 Binding Assay
pH7.4±n/a
Temperature298.15±n/a K
IC50 24.9±n/a nM
Commentsextracted
Citation Petrukhin, KCioffi, CJohnson, GAllikmets, RFreeman, EChen, PConlon, MZhu, L Substituted 4-phenylpiperidines, their preparation and use US Patent US10072016 Publication Date 9/11/2018
 
Transthyretin
Name:Transthyretin
Type:Enzyme
Mol. Mass.:15884.31
Organism:Homo sapiens (Human)
Description:P02766
Residue:147
BDBM249526
NameBDBM249526
Synonyms:US10072016, Compound 124 US10913746, Compound 124 US9434727, 124 | US9777010, Compound 124
TypeSmall organic molecule
Emp. Form.C22H25F5N4O2
Mol. Mass.472.4515
SMILESCOCCN1CCc2c(C1)[nH]nc2C(=O)N1CCC(CC1)c1ccc(F)c(F)c1C(F)(F)F