Reaction Details
TargetTransthyretin
LigandBDBM249543
Substrate/Competitorn/a
Meas. Tech.Scintillation Proximity RBP4 Binding Assay
pH7.4±n/a
Temperature298.15±n/a K
IC50 20.8±n/a nM
Commentsextracted
Citation Petrukhin, KCioffi, CJohnson, GAllikmets, RFreeman, EChen, PConlon, MZhu, L Substituted 4-phenylpiperidines, their preparation and use US Patent US10072016 Publication Date 9/11/2018
 
Transthyretin
Name:Transthyretin
Type:Enzyme
Mol. Mass.:15884.31
Organism:Homo sapiens (Human)
Description:P02766
Residue:147
BDBM249543
NameBDBM249543
Synonyms:US10072016, Compound 141 US10913746, Compound 141 US9434727, 141 | US9777010, Compound 141
TypeSmall organic molecule
Emp. Form.C20H22F4N4O3S
Mol. Mass.474.472
SMILESCS(=O)(=O)N1CCc2[nH]nc(C(=O)N3CCC(CC3)c3cc(F)ccc3C(F)(F)F)c2C1