Reaction Details
TargetPro-FMRFamide-related neuropeptide FF
LigandBDBM86139
Substrate/Competitorn/a
Ki 5.2±n/a nM
CommentsPDSP_3002
Citation Engström, MBrandt, AWurster, SSavola, JMPanula, P Prolactin releasing peptide has high affinity and efficacy at neuropeptide FF2 receptors. J Pharmacol Exp Ther305:825-32 (2003) 
 
Pro-FMRFamide-related neuropeptide FF
Name:Pro-FMRFamide-related neuropeptide FF
Type:Enzyme Catalytic Domain
Mol. Mass.:13156.33
Organism:RAT
Description:NPFF 0 RAT::Q9WVA9
Residue:114
BDBM86139
NameBDBM86139
Synonyms:CAS_235433-36-0 NPSF PrRP31
TypeSmall organic molecule
Emp. Form.C54H76N14O10
Mol. Mass.1081.269
SMILES[#6]-[#6](-[#6])-[#6]-[#6@H](-[#7]-[#6](=O)-[#6@@H](-[#7])-[#6]-c1ccccc1)-[#6](=O)-[#7]-[#6@@H](-[#6]-c1ccccc1)-[#6](=O)-[#7]-[#6@@H](-[#6]-[#6]-[#6](-[#7])=O)-[#6](=O)-[#7]-1-[#6]-[#6]-[#6]-[#6@H]-1-[#6](=O)-[#7]-[#6@@H](-[#6]-[#6]-[#6](-[#7])=O)-[#6](=O)-[#7]-[#6@@H](-[#6]-[#6]-[#6]\[#7]=[#6](/[#7])-[#7])-[#6](=O)-[#7]-[#6@@H](-[#6]-c1ccccc1)-[#6](-[#7])=O