Reaction Details
TargetD(3) dopamine receptor
LigandBDBM50001888
Substrate/Competitorn/a
Ki 0.9±n/a nM
CommentsPDSP_513
Citation Qandil, AMLewis, MMJassen, ALeonard, SKMailman, RBNichols, DE Synthesis and pharmacological evaluation of substituted naphth[1,2,3-de]isoquinolines (dinapsoline analogues) as D1 and D2 dopamine receptor ligands. Bioorg Med Chem11:1451-64 (2003) 
 
D(3) dopamine receptor
Name:D(3) dopamine receptor
Type:Protein
Mol. Mass.:49540.58
Organism:Rattus norvegicus (Rat)
Description:P19020
Residue:446
BDBM50001888
NameBDBM50001888
Synonyms:(chloropromazine) [3-(2-Chloro-phenothiazin-10-yl)-propyl]-dimethyl-amine 1-(2-Allyl-phenoxy)-3-isopropylamino-propan-2-ol 3-(2-chloro-10H-phenothiazin-10-yl)-N,N-dimethylpropan-1-amine CHLORPROMAZINE CHLORPROMAZINE HYDROCHLORIDE CHLORPROMAZINE TANNATE PROMAPAR THORAZINE [3-(2-Chloro-phenothiazin-10-yl)-propyl]-dimethyl-amine( Chlorpromazine) chloropromazine | med.21724, Compound 15
TypeSmall organic molecule
Emp. Form.C17H19ClN2S
Mol. Mass.318.864
SMILESCN(C)CCCN1c2ccccc2Sc2ccc(Cl)cc12