Reaction Details
TargetD(1B) dopamine receptor
LigandBDBM50117181
Substrate/Competitorn/a
Ki 5±n/a nM
CommentsPDSP_4939
Citation Qandil, AMLewis, MMJassen, ALeonard, SKMailman, RBNichols, DE Synthesis and pharmacological evaluation of substituted naphth[1,2,3-de]isoquinolines (dinapsoline analogues) as D1 and D2 dopamine receptor ligands. Bioorg Med Chem11:1451-64 (2003) 
 
D(1B) dopamine receptor
Name:D(1B) dopamine receptor
Type:Enzyme Catalytic Domain
Mol. Mass.:52827.88
Organism:RAT
Description:Dopamine D1B 0 RAT::P25115
Residue:475
BDBM50117181
NameBDBM50117181
Synonyms:(S)-2,3,7,11b-Tetrahydro-1H-dibenzo[de,h]isoquinoline-8,9-diol CHEMBL124561 Dinapsoline, (R)(+)
TypeSmall organic molecule
Emp. Form.C16H15NO2
Mol. Mass.253.2958
SMILESOc1ccc2[C@@H]3CNCc4cccc(Cc2c1O)c34