Reaction Details
TargetD(1A) dopamine receptor
LigandBDBM86180
Substrate/Competitorn/a
Ki 0.69±n/a nM
CommentsPDSP_1685
Citation Qandil, AMLewis, MMJassen, ALeonard, SKMailman, RBNichols, DE Synthesis and pharmacological evaluation of substituted naphth[1,2,3-de]isoquinolines (dinapsoline analogues) as D1 and D2 dopamine receptor ligands. Bioorg Med Chem11:1451-64 (2003) 
 
D(1A) dopamine receptor
Name:D(1A) dopamine receptor
Type:Enzyme Catalytic Domain
Mol. Mass.:49429.75
Organism:RAT
Description:P18901
Residue:446
BDBM86180
NameBDBM86180
Synonyms:CAS_87075-17-0 SCH 23390 US9359372, SCH23390
TypeSmall organic molecule
Emp. Form.C17H18ClNO
Mol. Mass.287.784
SMILESCN1CCc2cc(Cl)c(O)cc2C(C1)c1ccccc1