Reaction Details
TargetHistamine H1 receptor
LigandBDBM86188
Substrate/Competitorn/a
Ki 1000±n/a nM
CommentsPDSP_3074
Citation McLeod, RLRizzo, CAWest, REAslanian, RMcCormick, KBryant, MHsieh, YKorfmacher, WMingo, GGVarty, LWilliams, SMShih, NYEgan, RWHey, JA Pharmacological characterization of the novel histamine H3-receptor antagonist N-(3,5-dichlorophenyl)-N'-[[4-(1H-imidazol-4-ylmethyl)phenyl]-methyl]-urea (SCH 79687). J Pharmacol Exp Ther305:1037-44 (2003) 
 
Histamine H1 receptor
Name:Histamine H1 receptor
Type:G Protein-Coupled Receptor (GPCR)
Mol. Mass.:55641.53
Organism:Cavia porcellus (domestic guinea pig)
Description:Guinea pig cerebellum was used in binding assay.
Residue:488
BDBM86188
NameBDBM86188
Synonyms:CHEMBL366977 | SCH 79687
TypeSmall organic molecule
Emp. Form.C18H16Cl2N4O
Mol. Mass.375.252
SMILESClc1cc(Cl)cc(NC(=O)NCc2ccc(Cc3cnc[nH]3)cc2)c1