Reaction Details
TargetCorticotropin-releasing factor receptor 1
LigandBDBM86192
Substrate/Competitorn/a
Ki 4.9±n/a nM
CommentsPDSP_3061
Citation Zhang, GHuang, NLi, YWQi, XMarshall, APYan, XXHill, GRominger, CPrakash, SRBakthavatchalam, RRominger, DHGilligan, PJZaczek, R Pharmacological characterization of a novel nonpeptide antagonist radioligand, (+/-)-N-[2-methyl-4-methoxyphenyl]-1-(1-(methoxymethyl) propyl)-6-methyl-1H-1,2,3-triazolo[4,5-c]pyridin-4-amine ([3H]SN003) for corticotropin-releasing factor1 receptors. J Pharmacol Exp Ther305:57-69 (2003) 
 
Corticotropin-releasing factor receptor 1
Name:Corticotropin-releasing factor receptor 1
Type:Enzyme
Mol. Mass.:50744.31
Organism:Homo sapiens (Human)
Description:P34998
Residue:444
BDBM86192
NameBDBM86192
Synonyms:CAS_197801-88-0 SN003
TypeSmall organic molecule
Emp. Form.C19H25N5O2
Mol. Mass.355.4341
SMILESCCC(COC)n1nnc2c(Nc3ccc(OC)cc3C)nc(C)cc12