Reaction Details
TargetNeuronal acetylcholine receptor subunit alpha-3
LigandBDBM86205
Substrate/Competitorn/a
Ki>10000±n/a nM
CommentsPDSP_2973
Citation Shi, QSavage, JEHufeisen, SJRauser, LGrajkowska, EErnsberger, PWroblewski, JTNadeau, JHRoth, BL L-homocysteine sulfinic acid and other acidic homocysteine derivatives are potent and selective metabotropic glutamate receptor agonists. J Pharmacol Exp Ther305:131-42 (2003) 
 
Neuronal acetylcholine receptor subunit alpha-3
Name:Neuronal acetylcholine receptor subunit alpha-3
Type:Enzyme Catalytic Domain
Mol. Mass.:57479.03
Organism:Homo sapiens (Human)
Description:Cholinergic, Nicotinic Alpha3Beta2 0 HUMAN::P32297
Residue:505
BDBM86205
NameBDBM86205
Synonyms:D-homocysteine thiolactone
TypeSmall organic molecule
Emp. Form.C4H7NOS
Mol. Mass.117.169
SMILESN[C@@H]1CCSC1=O