Reaction Details
TargetVasopressin V1a receptor
LigandBDBM86209
Substrate/Competitorn/a
Ki 3.5±n/a nM
CommentsPDSP_6851
Citation Cirillo, RGillio Tos, ESchwarz, MKQuattropani, AScheer, AMissotten, MDorbais, JNichols, ABorrelli, FGiachetti, CGolzio, LMarinelli, PThomas, RJChevillard, CLaurent, FPortet, KBarberis, CChollet, A Pharmacology of (2S,4Z)-N-[(2S)-2-hydroxy-2-phenylethyl]-4-(methoxyimino) -1-[(2'-methyl[1,1'-biphenyl]-4-yl)carbonyl]-2-pyrrolidinecarboxamide, a new potent and selective nonpeptide antagonist of the oxytocin receptor. J Pharmacol Exp Ther306:253-61 (2003) 
 
Vasopressin V1a receptor
Name:Vasopressin V1a receptor
Type:Receptor
Mol. Mass.:46820.18
Organism:Homo sapiens (Human)
Description:P37288
Residue:418
BDBM86209
NameBDBM86209
Synonyms:Atosiban NSC_0
TypeSmall organic molecule
Emp. Form.C43H67N11O12S2
Mol. Mass.994.189
SMILESCCOc1ccc(CC2NC(=O)CCSSCC(NC(=O)C(CC(N)=O)NC(=O)C(NC(=O)C(NC2=O)C(C)CC)C(C)O)C(=O)N2CCCC2C(=O)NC(CCCN)C(=O)NCC(N)=O)cc1