Reaction Details
TargetNeuronal acetylcholine receptor subunit alpha-3
LigandBDBM50170601
Substrate/Competitorn/a
Ki 116±n/a nM
CommentsPDSP_3056
Citation Cohen, CBergis, OEGalli, FLochead, AWJegham, SBiton, BLeonardon, JAvenet, PSgard, FBesnard, FGraham, DCoste, AOblin, ACuret, OVoltz, CGardes, ACaille, DPerrault, GGeorge, PSoubrie, PScatton, B SSR591813, a novel selective and partial alpha4beta2 nicotinic receptor agonist with potential as an aid to smoking cessation. J Pharmacol Exp Ther306:407-20 (2003) 
 
Neuronal acetylcholine receptor subunit alpha-3
Name:Neuronal acetylcholine receptor subunit alpha-3
Type:Enzyme Catalytic Domain
Mol. Mass.:57479.03
Organism:Homo sapiens (Human)
Description:Cholinergic, Nicotinic Alpha3Beta2 0 HUMAN::P32297
Residue:505
BDBM50170601
NameBDBM50170601
Synonyms:(1R,10S)-9-oxa-4,13-diazatetracyclo[11.2.1.0^{1,10}.0^{3,8}]hexadeca-3,5,7-triene SSR591813
TypeSmall organic molecule
Emp. Form.C13H16N2O
Mol. Mass.216.2789
SMILESC1C[C@@]23CN1CC[C@@H]2Oc1cccnc1C3