Reaction Details
TargetMetabotropic glutamate receptor 1
LigandBDBM50212323
Substrate/Competitorn/a
Ki 11.2±n/a nM
CommentsPDSP_3099
Citation Lavreysen, HJanssen, CBischoff, FLanglois, XLeysen, JELesage, AS [3H]R214127: a novel high-affinity radioligand for the mGlu1 receptor reveals a common binding site shared by multiple allosteric antagonists. Mol Pharmacol63:1082-93 (2003) 
 
Metabotropic glutamate receptor 1
Name:Metabotropic glutamate receptor 1
Type:Enzyme Catalytic Domain
Mol. Mass.:133240.47
Organism:RAT
Description:metabotropic glutamate 1/2 0 RAT::P23385
Residue:1199
BDBM50212323
NameBDBM50212323
Synonyms:(3aS,6aS)-5-methylene-6a-(naphthalen-2-ylmethyl)-hexahydrocyclopenta[c]furan-1-one Bay 36-7620 | CHEMBL254372
TypeSmall organic molecule
Emp. Form.C19H18O2
Mol. Mass.278.345
SMILESC=C1C[C@@H]2COC(=O)[C@]2(Cc2ccc3ccccc3c2)C1