Reaction Details
TargetcAMP-specific 3',5'-cyclic phosphodiesterase 4B
LigandBDBM86218
Substrate/Competitorn/a
Ki 600±n/a nM
CommentsPDSP_3033
Citation Zhao, YZhang, HTO'Donnell, JM Inhibitor binding to type 4 phosphodiesterase (PDE4) assessed using [3H]piclamilast and [3H]rolipram. J Pharmacol Exp Ther305:565-72 (2003) 
 
cAMP-specific 3',5'-cyclic phosphodiesterase 4B
Name:cAMP-specific 3',5'-cyclic phosphodiesterase 4B
Type:Enzyme Catalytic Domain
Mol. Mass.:83349.50
Organism:RAT
Description:P14646
Residue:736
BDBM86218
NameBDBM86218
Synonyms:CAS_0 NSC_0
TypeSmall organic molecule
Emp. Form.C17H16Cl2N2O3
Mol. Mass.367.227
SMILESOc1ccc(cc1OC1CCCC1)C(=O)Nc1c(Cl)cncc1Cl