Reaction Details
TargetPyroglutamylated RF-amide peptide receptor
LigandBDBM86224
Substrate/Competitorn/a
Ki 258±n/a nM
CommentsPDSP_7186
Citation Jiang, YLuo, LGustafson, ELYadav, DLaverty, MMurgolo, NVassileva, GZeng, MLaz, TMBehan, JQiu, PWang, LWang, SBayne, MGreene, JMonsma, FZhang, FL Identification and characterization of a novel RF-amide peptide ligand for orphan G-protein-coupled receptor SP9155. J Biol Chem278:27652-7 (2003) 
 
Pyroglutamylated RF-amide peptide receptor
Name:Pyroglutamylated RF-amide peptide receptor
Type:Enzyme Catalytic Domain
Mol. Mass.:49508.46
Organism:Homo sapiens (Human)
Description:GPR103 0 HUMAN::Q96P65
Residue:431
BDBM86224
NameBDBM86224
Synonyms:P513
TypeSmall organic molecule
Emp. Form.C46H65N13O9
Mol. Mass.944.09
SMILES[#7]-[#6]-[#6]-[#6]-[#6]-[#6@H](-[#7])-[#6](=O)-[#7]-[#6]-[#6](=O)-[#7]-[#6]-[#6](=O)-[#7]-[#6@@H](-[#6]-c1ccccc1)-[#6](=O)-[#7]-[#6@@H](-[#6]-[#8])-[#6](=O)-[#7]-[#6@@H](-[#6]-c1ccccc1)-[#6](=O)-[#7]-[#6@@H](-[#6]-[#6]-[#6]\[#7]=[#6](\[#7])-[#7])-[#6](=O)-[#7]-[#6](-[#6]-c1ccccc1)-[#6](-[#7])=O