Reaction Details
TargetPyroglutamylated RF-amide peptide receptor
LigandBDBM86227
Substrate/Competitorn/a
Ki 607±n/a nM
CommentsPDSP_7190
Citation Jiang, YLuo, LGustafson, ELYadav, DLaverty, MMurgolo, NVassileva, GZeng, MLaz, TMBehan, JQiu, PWang, LWang, SBayne, MGreene, JMonsma, FZhang, FL Identification and characterization of a novel RF-amide peptide ligand for orphan G-protein-coupled receptor SP9155. J Biol Chem278:27652-7 (2003) 
 
Pyroglutamylated RF-amide peptide receptor
Name:Pyroglutamylated RF-amide peptide receptor
Type:Enzyme Catalytic Domain
Mol. Mass.:49508.46
Organism:Homo sapiens (Human)
Description:GPR103 0 HUMAN::Q96P65
Residue:431
BDBM86227
NameBDBM86227
Synonyms:P552
TypeSmall organic molecule
Emp. Form.C131H215N45O35S
Mol. Mass.3012.454
SMILESCCC(C)[C@H](NC(=O)[C@@H](NC(=O)[C@H](CCC(C)C)NC(=O)[C@H](CC(C)C)NC(=O)[C@H](C)NC(=O)[C@H](CCC(N)=O)NC(=O)[C@@H]1CCCN1C(=O)[C@H](CCC(N)=O)NC(=O)[C@H](CO)NC(=O)[C@H](C)N)C(C)C)C(=O)N[C@@H](CCCN=C(N)N)C(=O)NCC(=O)N[C@@H](CC(C)C)C(=O)N[C@@H](CCC(N)=O)C(=O)N[C@@H](C(C)O)C(=O)N[C@@H](CO)C(=O)NCC(=O)N[C@@H](CCCNC(N)=N)C(=O)N[C@@H](CCC(O)=O)C(=O)N[C@@H](Cc1cnc[nH]1)C(=O)N[C@@H](C)C(=O)NCC(=O)N[C@@H](CS)C(=O)N[C@@H](CCCN=C(N)N)C(=O)N[C@@H](Cc1ccccc1)C(=O)N[C@@H](CCCN=C(N)N)C(=O)NC(Cc1ccccc1)C(N)=O