Reaction Details
TargetSubstance-P receptor
LigandBDBM50133817
Substrate/Competitorn/a
Ki>10000±n/a nM
CommentsPDSP_7569
Citation Valenzano, KJGrant, ERWu, GHachicha, MSchmid, LTafesse, LSun, QRotshteyn, YFrancis, JLimberis, JMalik, SWhittemore, ERHodges, D N-(4-tertiarybutylphenyl)-4-(3-chloropyridin-2-yl)tetrahydropyrazine -1(2H)-carbox-amide (BCTC), a novel, orally effective vanilloid receptor 1 antagonist with analgesic properties: I. in vitro characterization and pharmacokinetic properties. J Pharmacol Exp Ther306:377-86 (2003) 
 
Substance-P receptor
Name:Substance-P receptor
Type:G Protein-Coupled Receptor (GPCR)
Mol. Mass.:46371.54
Organism:Rattus norvegicus (rat)
Description:Competition binding assays were carried out using membrane preparations from transfected CHO cells that constitutively expressed the rat NK1 receptor.
Residue:407
BDBM50133817
NameBDBM50133817
Synonyms:4-(3-Chloro-pyridin-2-yl)-piperazine-1-carboxylic acid (4-tert-butyl-phenyl)-amide CHEMBL441472 | N-(4-tert-butylphenyl)-4-(3-chloropyridin-2-yl)piperazine-1-carboxamide
TypeSmall organic molecule
Emp. Form.C20H25ClN4O
Mol. Mass.372.892
SMILESCC(C)(C)c1ccc(NC(=O)N2CCN(CC2)c2ncccc2Cl)cc1