Reaction Details
TargetNeuronal acetylcholine receptor subunit alpha-6
LigandBDBM50060582
Substrate/Competitorn/a
Ki>10000±n/a nM
CommentsPDSP_632
Citation Vailati, SMoretti, MLonghi, RRovati, GEClementi, FGotti, C Developmental expression of heteromeric nicotinic receptor subtypes in chick retina. Mol Pharmacol63:1329-37 (2003) 
 
Neuronal acetylcholine receptor subunit alpha-6
Name:Neuronal acetylcholine receptor subunit alpha-6
Type:Enzyme Catalytic Domain
Mol. Mass.:57501.33
Organism:Chick
Description:Cholinergic, Nicotinic Alpha6 0 Chick::P49581
Residue:494
BDBM50060582
NameBDBM50060582
Synonyms:1,10-Bis(trimethyl ammonium)decane dibromide CHEMBL1134 DECAMETHONIUM BROMIDE N,N,N'',N''-Tetramethyl-decane-1,10-diammonium; dibromide Syncurine | decane-1,10-bis(trimethylammonium bromide)
TypeSmall organic molecule
Emp. Form.C16H38N2
Mol. Mass.258.4852
SMILESC[N+](C)(C)CCCCCCCCCC[N+](C)(C)C