Reaction Details
TargetNeuronal acetylcholine receptor subunit alpha-6
LigandBDBM86241
Substrate/Competitorn/a
Ki 2800±n/a nM
CommentsPDSP_666
Citation Vailati, SMoretti, MLonghi, RRovati, GEClementi, FGotti, C Developmental expression of heteromeric nicotinic receptor subtypes in chick retina. Mol Pharmacol63:1329-37 (2003) 
 
Neuronal acetylcholine receptor subunit alpha-6
Name:Neuronal acetylcholine receptor subunit alpha-6
Type:Enzyme Catalytic Domain
Mol. Mass.:57501.33
Organism:Chick
Description:Cholinergic, Nicotinic Alpha6 0 Chick::P49581
Residue:494
BDBM86241
NameBDBM86241
Synonyms:CAS_23255-54-1 NSC_31762
TypeSmall organic molecule
Emp. Form.C16H21NO3
Mol. Mass.275.3428
SMILESCOC1CC=C2CCN3CCC4=C(CC(=O)OC4)C23C1