Reaction Details
TargetNeuronal acetylcholine receptor subunit alpha-6
LigandBDBM86243
Substrate/Competitorn/a
Ki 4520±n/a nM
CommentsPDSP_3078
Citation Vailati, SMoretti, MLonghi, RRovati, GEClementi, FGotti, C Developmental expression of heteromeric nicotinic receptor subtypes in chick retina. Mol Pharmacol63:1329-37 (2003) 
 
Neuronal acetylcholine receptor subunit alpha-6
Name:Neuronal acetylcholine receptor subunit alpha-6
Type:Enzyme Catalytic Domain
Mol. Mass.:57501.33
Organism:Chick
Description:Cholinergic, Nicotinic Alpha6 0 Chick::P49581
Residue:494
BDBM86243
NameBDBM86243
Synonyms:CAS_17360 NSC_17360
TypeSmall organic molecule
Emp. Form.C22H30NO
Mol. Mass.324.4792
SMILESCC[N+](CC)(CC)CCOc1ccc(C=Cc2ccccc2)cc1