Reaction Details
TargetNeuronal acetylcholine receptor subunit alpha-6
LigandBDBM50004108
Substrate/Competitorn/a
Ki 20±n/a nM
CommentsPDSP_1311
Citation Vailati, SMoretti, MLonghi, RRovati, GEClementi, FGotti, C Developmental expression of heteromeric nicotinic receptor subtypes in chick retina. Mol Pharmacol63:1329-37 (2003) 
 
Neuronal acetylcholine receptor subunit alpha-6
Name:Neuronal acetylcholine receptor subunit alpha-6
Type:Enzyme Catalytic Domain
Mol. Mass.:57501.33
Organism:Chick
Description:Cholinergic, Nicotinic Alpha6 0 Chick::P49581
Residue:494
BDBM50004108
NameBDBM50004108
Synonyms:(+-)-nicotine (RS)-nicotine CHEMBL440464 Nicotine-(+) US11667638, Example Nicotine US9284322, Nicotine nicotine
TypeSmall organic molecule
Emp. Form.C10H14N2
Mol. Mass.162.2316
SMILESCN1CCCC1c1cccnc1