Reaction Details
TargetCholinergic receptor nicotinic alpha 6 subunit
LigandBDBM10759
Substrate/Competitorn/a
Ki 123±n/a nM
CommentsPDSP_229
Citation Vailati, SMoretti, MLonghi, RRovati, GEClementi, FGotti, C Developmental expression of heteromeric nicotinic receptor subtypes in chick retina. Mol Pharmacol63:1329-37 (2003) 
 
Cholinergic receptor nicotinic alpha 6 subunit
Name:Cholinergic receptor nicotinic alpha 6 subunit
Synonyms:Cholinergic, Nicotinic Alpha6Beta2
Type:Enzyme Catalytic Domain
Mol. Mass.:57281.61
Organism:Chick
Description:Cholinergic, Nicotinic Alpha6Beta2 0 Chick::F7CGJ7
Residue:492
BDBM10759
NameBDBM10759
TypeSmall Organic Molecule
Emp. Form.C7H16NO2
Mol. Mass.146.2069
SMILESCC(=O)OCC[N+](C)(C)C