Reaction Details
TargetCholinergic receptor nicotinic alpha 6 subunit
LigandBDBM86240
Substrate/Competitorn/a
Ki 2000±n/a nM
CommentsPDSP_3077
Citation Vailati, SMoretti, MLonghi, RRovati, GEClementi, FGotti, C Developmental expression of heteromeric nicotinic receptor subtypes in chick retina. Mol Pharmacol63:1329-37 (2003) 
 
Cholinergic receptor nicotinic alpha 6 subunit
Name:Cholinergic receptor nicotinic alpha 6 subunit
Synonyms:Cholinergic, Nicotinic Alpha6Beta2
Type:Enzyme Catalytic Domain
Mol. Mass.:57281.61
Organism:Chick
Description:Cholinergic, Nicotinic Alpha6Beta2 0 Chick::F7CGJ7
Residue:492
BDBM86240
NameBDBM86240
TypeSmall organic molecule
Emp. Form.C67H103N23O22S4
Mol. Mass.1710.936
SMILESCC(C)C[C@@H]1NC(=O)[C@H](Cc2cnc[nH]2)NC(=O)[C@@H]2CSSC[C@H](NC(=O)CN)C(=O)N[C@@H](CSSC[C@H](NC(=O)[C@H](CC(C)C)NC(=O)[C@H](CC(N)=O)NC(=O)[C@H](CO)NC(=O)[C@H](Cc3cnc[nH]3)NC(=O)[C@H](CCC(O)=O)NC1=O)C(N)=O)C(=O)N[C@@H](CO)C(=O)N[C@@H](CC(N)=O)C(=O)N1CCC[C@H]1C(=O)N[C@@H](C(C)C)C(=O)N2