Reaction Details
TargetCholinergic receptor nicotinic alpha 6 subunit
LigandBDBM50038416
Substrate/Competitorn/a
Ki>10000±n/a nM
CommentsPDSP_927
Citation Vailati, SMoretti, MLonghi, RRovati, GEClementi, FGotti, C Developmental expression of heteromeric nicotinic receptor subtypes in chick retina. Mol Pharmacol63:1329-37 (2003) 
 
Cholinergic receptor nicotinic alpha 6 subunit
Name:Cholinergic receptor nicotinic alpha 6 subunit
Synonyms:Cholinergic, Nicotinic Alpha6Beta2
Type:Enzyme Catalytic Domain
Mol. Mass.:57281.61
Organism:Chick
Description:Cholinergic, Nicotinic Alpha6Beta2 0 Chick::F7CGJ7
Residue:492
BDBM50038416
NameBDBM50038416
TypeSmall organic molecule
Emp. Form.C12H30N2
Mol. Mass.202.3789
SMILESC[N+](C)(C)CCCCCC[N+](C)(C)C