Reaction Details
TargetUncharacterized protein
LigandBDBM50038416
Substrate/Competitorn/a
Ki>10000±n/a nM
CommentsPDSP_927
Citation Vailati, SMoretti, MLonghi, RRovati, GEClementi, FGotti, C Developmental expression of heteromeric nicotinic receptor subtypes in chick retina. Mol Pharmacol63:1329-37 (2003) 
 
Uncharacterized protein
Name:Uncharacterized protein
Synonyms:Cholinergic, Nicotinic Alpha6Beta4
Type:Enzyme Catalytic Domain
Mol. Mass.:55323.77
Organism:Chick
Description:Cholinergic, Nicotinic Alpha6Beta4 0 Chick::F6Z813
Residue:486
BDBM50038416
NameBDBM50038416
TypeSmall organic molecule
Emp. Form.C12H30N2
Mol. Mass.202.3789
SMILESC[N+](C)(C)CCCCCC[N+](C)(C)C